BDBM50252828 CHEMBL493689::N-(Naphthalene-2-yl)ethyl-ETAV
SMILES CC(C)[C@H](NC(=O)[C@H](C)NC(=O)[C@@H](NC(=O)[C@H](CCC(O)=O)NCCc1ccc2ccccc2c1)C(C)O)C(O)=O
InChI Key InChIKey=BVNXVJDQOOZPCM-FZDDQCGTSA-N
Data  3 KI
  Tab Delimited (TSV)   2D SDfile   Computed 3D by Vconf -m prep SDfile
Find this compound or compounds like it in BindingDB:
Activity Spreadsheet -- Enzyme Inhibition Constant Data from BindingDB
Found 3 hits for monomerid = 50252828
TargetDisks large homolog 4(Homo sapiens (Human))
University Of Copenhagen
Curated by ChEMBL
LigandPNGBDBM50252828(CHEMBL493689 | N-(Naphthalene-2-yl)ethyl-ETAV)
Affinity DataKi:  950nM. Assay description: Binding affinity to human PSD95 domain PDZ2 expressed in Escherichia coli BL21-DE3 by fluorescence polarization assay
In DepthDetails ArticlePubMed
TargetDisks large homolog 4(Homo sapiens (Human))
University Of Copenhagen
Curated by ChEMBL
LigandPNGBDBM50252828(CHEMBL493689 | N-(Naphthalene-2-yl)ethyl-ETAV)
Affinity DataKi:  1.00E+3nM. Assay description: Binding affinity to human PSD95 domain PDZ1 expressed in Escherichia coli BL21-DE3 by fluorescence polarization assay
In DepthDetails ArticlePubMed
TargetDisks large homolog 4(Homo sapiens (Human))
University Of Copenhagen
Curated by ChEMBL
LigandPNGBDBM50252828(CHEMBL493689 | N-(Naphthalene-2-yl)ethyl-ETAV)
Affinity DataKi:  1.00E+4nM. Assay description: Binding affinity to human PSD95 domain PDZ3 expressed in Escherichia coli BL21-DE3 by fluorescence polarization assay
In DepthDetails ArticlePubMed