BDBM50252903 Ac-His-DPhe(3,4-diCl)-Arg-Trp-NH2::CHEMBL501394
SMILES CC(=O)N[C@@H](Cc1cnc[nH]1)C(=O)N[C@H](Cc1ccc(Cl)c(Cl)c1)C(=O)N[C@@H](CCCN=C(N)N)C(=O)N[C@@H](Cc1c[nH]c2ccccc12)C(N)=O
InChI Key InChIKey=ULVZZVUTBBXNBL-FKWFRFQNSA-N
Data  1 KI  3 EC50
  Tab Delimited (TSV)   2D SDfile   Computed 3D by Vconf -m prep SDfile
Find this compound or compounds like it in BindingDB:
Activity Spreadsheet -- Enzyme Inhibition Constant Data from BindingDB
Found 4 hits for monomerid = 50252903
TargetMelanocortin receptor 3(Mus musculus)
University Of Florida
Curated by ChEMBL
LigandPNGBDBM50252903(Ac-His-DPhe(3,4-diCl)-Arg-Trp-NH2 | CHEMBL501394)
Affinity DataKi:  260nM. Assay description: Antagonist activity at mouse MC3R expressed in HEK293 cells assessed as effect on MT2 peptide-induced response by CRE/beta-galactosidase reporter gen...
In DepthDetails ArticlePubMed
TargetMelanocortin receptor 4(Mus musculus)
University Of Florida
Curated by ChEMBL
LigandPNGBDBM50252903(Ac-His-DPhe(3,4-diCl)-Arg-Trp-NH2 | CHEMBL501394)
Affinity DataEC50:  3.40nM. Assay description: Agonist activity at mouse MC4R expressed in HEK293 cells by CRE/beta-galactosidase reporter gene assay
In DepthDetails ArticlePubMed
TargetMelanocortin receptor 5(Mus musculus (Mouse))
University Of Florida
Curated by ChEMBL
LigandPNGBDBM50252903(Ac-His-DPhe(3,4-diCl)-Arg-Trp-NH2 | CHEMBL501394)
Affinity DataEC50:  7.42nM. Assay description: Agonist activity at mouse MC5R expressed in HEK293 cells by CRE/beta-galactosidase reporter gene assay
In DepthDetails ArticlePubMed
TargetMelanocyte-stimulating hormone receptor(Mus musculus)
University Of Florida
Curated by ChEMBL
LigandPNGBDBM50252903(Ac-His-DPhe(3,4-diCl)-Arg-Trp-NH2 | CHEMBL501394)
Affinity DataEC50:  140nM. Assay description: Agonist activity at mouse MC1R expressed in HEK293 cells by CRE/beta-galactosidase reporter gene assay
In DepthDetails ArticlePubMed