BDBM50252919 (S,S)-1,3-Di(3'-amino-3'-carboxypropyl)-6,7-dihydro-1H-cyclopenta[d]pyrimidin-2,4(3H,5H)-dione::CHEMBL492628
SMILES N[C@@H](CCn1c2CCCc2c(=O)n(CC[C@H](N)C(O)=O)c1=O)C(O)=O
InChI Key InChIKey=RPYXYQHRAXAOCI-UWVGGRQHSA-N
Data  6 KI
  Tab Delimited (TSV)   2D SDfile   Computed 3D by Vconf -m prep SDfile
Find this compound or compounds like it in BindingDB:
Activity Spreadsheet -- Enzyme Inhibition Constant Data from BindingDB
Found 6 hits for monomerid = 50252919
TargetGlutamate receptor 1(Rattus norvegicus (Rat))
European Research Centre For Drug Discovery And Development (Natsyndrugs)
Curated by ChEMBL
LigandPNGBDBM50252919((S,S)-1,3-Di(3'-amino-3'-carboxypropyl)-6,7-dihydr...)
Affinity DataKi: >1.00E+5nM. Assay description: Displacement of (R,S)-[5-methyl-3H]AMPA from rat recombinant flop iGluR1 expressed in Sf9 cells
In DepthDetails ArticlePubMed
TargetGlutamate receptor 2(Rattus norvegicus)
European Research Centre For Drug Discovery And Development (Natsyndrugs)
Curated by ChEMBL
LigandPNGBDBM50252919((S,S)-1,3-Di(3'-amino-3'-carboxypropyl)-6,7-dihydr...)
Affinity DataKi: >1.00E+5nM. Assay description: Displacement of (R,S)-[5-methyl-3H]AMPA from rat recombinant flop iGluR2(R) expressed in Sf9 cells
In DepthDetails ArticlePubMed
TargetGlutamate receptor 3(RAT)
European Research Centre For Drug Discovery And Development (Natsyndrugs)
Curated by ChEMBL
LigandPNGBDBM50252919((S,S)-1,3-Di(3'-amino-3'-carboxypropyl)-6,7-dihydr...)
Affinity DataKi: >1.00E+5nM. Assay description: Displacement of (R,S)-[5-methyl-3H]AMPA from rat recombinant flop iGluR3 expressed in Sf9 cells
In DepthDetails ArticlePubMed
TargetGlutamate receptor ionotropic, kainate 2(Rattus norvegicus)
European Research Centre For Drug Discovery And Development (Natsyndrugs)
Curated by ChEMBL
LigandPNGBDBM50252919((S,S)-1,3-Di(3'-amino-3'-carboxypropyl)-6,7-dihydr...)
Affinity DataKi: >1.00E+5nM. Assay description: Displacement of [3H]kainic acid from rat recombinant iGluR6(V,C,R) receptor expressed in Sf9 cells
In DepthDetails ArticlePubMed
TargetGlutamate receptor 4(Rattus norvegicus)
European Research Centre For Drug Discovery And Development (Natsyndrugs)
Curated by ChEMBL
LigandPNGBDBM50252919((S,S)-1,3-Di(3'-amino-3'-carboxypropyl)-6,7-dihydr...)
Affinity DataKi: >1.00E+5nM. Assay description: Displacement of (R,S)-[5-methyl-3H]AMPA from rat recombinant flop iGluR4 expressed in Sf9 cells
In DepthDetails ArticlePubMed
TargetGlutamate receptor ionotropic, kainate 1(RAT)
European Research Centre For Drug Discovery And Development (Natsyndrugs)
Curated by ChEMBL
LigandPNGBDBM50252919((S,S)-1,3-Di(3'-amino-3'-carboxypropyl)-6,7-dihydr...)
Affinity DataKi: >1.00E+6nM. Assay description: Displacement of [3H]SYM2081 from rat recombinant iGluR5(Q)1b expressed in Sf9 cells
In DepthDetails ArticlePubMed