BDBM50253593 2-(3,4-Dimethylphenylamino)-5-(3-furan-2-ylallylidene)thiazol-4-one::2-(3,4-dimethylphenylamino)-5-(3-(furan-2-yl)allylidene)thiazol-4(5H)-one::CHEMBL523844::cid_5588055
SMILES Cc1ccc(NC2=NC(=O)C(S2)=CC=Cc2ccco2)cc1C
InChI Key InChIKey=WUUYGYKWRVUCMO-UHFFFAOYSA-N
Data  1 KI  9 IC50
  Tab Delimited (TSV)   2D SDfile   Computed 3D by Vconf -m prep SDfile
Find this compound or compounds like it in BindingDB:
Activity Spreadsheet -- Enzyme Inhibition Constant Data from BindingDB
Found 10 hits for monomerid = 50253593
TargetM-phase inducer phosphatase 1(Homo sapiens (Human))
Sejong University
Curated by ChEMBL
LigandPNGBDBM50253593(2-(3,4-Dimethylphenylamino)-5-(3-furan-2-ylallylid...)
Affinity DataKi:  2.14E+4nM. Assay description: Binding affinity to Cdc25A (336-523) (unknown origin) expressed in Escherichia coli by steady-state kinetic assay
In DepthDetails ArticlePubMed
TargetCysteine protease ATG4B(Homo sapiens (Human))
Burnham Center For Chemical Genomics
Curated by PubChem BioAssay
LigandPNGBDBM50253593(2-(3,4-Dimethylphenylamino)-5-(3-furan-2-ylallylid...)
Affinity DataIC50:  6.65E+3nM. Assay description: Data Source: Sanford-Burnham Center for Chemical Genomics (SBCCG) Source Affiliation: Sanford-Burnham Medical Research Institute (SBMRI, San Diego, C...
In DepthDetails PCBioAssay
TargetPhospholipase A2(Homo sapiens (Human))
Burnham Center For Chemical Genomics
Curated by PubChem BioAssay
LigandPNGBDBM50253593(2-(3,4-Dimethylphenylamino)-5-(3-furan-2-ylallylid...)
Affinity DataIC50:  5.94E+3nM. Assay description: Data Source: Sanford-Burnham Center for Chemical Genomics (SBCCG) Source Affiliation: Sanford-Burnham Medical Research Institute (SBMRI, San Diego, C...
In DepthDetails PCBioAssay
TargetPC4 and SFRS1-interacting protein(Homo sapiens (Human))
The Scripps Research Institute Molecular Screening Center
Curated by PubChem BioAssay
LigandPNGBDBM50253593(2-(3,4-Dimethylphenylamino)-5-(3-furan-2-ylallylid...)
Affinity DataIC50:  5.37E+4nM. Assay description: Source (MLPCN Center Name): The Scripps Research Institute Molecular Screening Center (SRIMSC) Affiliation: Ohio State University Assay Provider: Mam...
In DepthDetails PCBioAssay
TargetM-phase inducer phosphatase 2(Homo sapiens (Human))
Sejong University
Curated by ChEMBL
LigandPNGBDBM50253593(2-(3,4-Dimethylphenylamino)-5-(3-furan-2-ylallylid...)
Affinity DataIC50:  1.80E+3nM. Assay description: Inhibition of N-terminal 6xHis-tagged (378-566) catalytic domain of Cdc25B expressed in Escherichia coli after 20 mins by by fluorescent plate reader...
In DepthDetails ArticlePubMed
TargetM-phase inducer phosphatase 1(Homo sapiens (Human))
Sejong University
Curated by ChEMBL
LigandPNGBDBM50253593(2-(3,4-Dimethylphenylamino)-5-(3-furan-2-ylallylid...)
Affinity DataIC50:  4.27E+3nM. Assay description: Inhibition of Cdc25A (336-523) (unknown origin) expressed in Escherichia coli
In DepthDetails ArticlePubMed
TargetM-phase inducer phosphatase 2(Homo sapiens (Human))
Sejong University
Curated by ChEMBL
LigandPNGBDBM50253593(2-(3,4-Dimethylphenylamino)-5-(3-furan-2-ylallylid...)
Affinity DataIC50:  5.44E+3nM. Assay description: Inhibition of Cdc25B (378-566) (unknown origin) expressed in Escherichia coli
In DepthDetails ArticlePubMed
TargetM-phase inducer phosphatase 1(Homo sapiens (Human))
Sejong University
Curated by ChEMBL
LigandPNGBDBM50253593(2-(3,4-Dimethylphenylamino)-5-(3-furan-2-ylallylid...)
Affinity DataIC50:  7.10E+3nM. Assay description: Inhibition of N-terminal 6xHis-tagged human Cdc25A (336-523) catalytic domain expressed in Escherichia coli after 20 mins by fluorescent plate reader...
In DepthDetails ArticlePubMed
TargetInduced myeloid leukemia cell differentiation protein Mcl-1(Homo sapiens (Human))
Emory University
Curated by PubChem BioAssay
LigandPNGBDBM50253593(2-(3,4-Dimethylphenylamino)-5-(3-furan-2-ylallylid...)
Affinity DataIC50:  1.34E+4nM. Assay description: NIH Molecular Libraries Screening Centers Network [MLSCN] Emory Chemical Biology Discovery Center in MLSCN Assay provider: Nikolovska-Coleska, Univer...
In DepthDetails PCBioAssay
TargetPC4 and SFRS1-interacting protein(Homo sapiens (Human))
The Scripps Research Institute Molecular Screening Center
Curated by PubChem BioAssay
LigandPNGBDBM50253593(2-(3,4-Dimethylphenylamino)-5-(3-furan-2-ylallylid...)
Affinity DataIC50:  7.35E+3nM. Assay description: Source (MLPCN Center Name): The Scripps Research Institute Molecular Screening Center (SRIMSC) Affiliation: Ohio State University Assay Provider: Mam...
In DepthDetails PCBioAssay