BDBM50254000 3-(2-Fluorobenzyl)-7-(5-methyl-2-furyl)-3H-[1,2,3]triazolo[4,5-d]pyrimidine-5-amine::CHEMBL461857
SMILES Cc1ccc(o1)-c1nc(N)nc2n(Cc3ccccc3F)nnc12
InChI Key InChIKey=ZTAHTOOYAQNJRV-UHFFFAOYSA-N
Data  4 KI
  Tab Delimited (TSV)   2D SDfile   Computed 3D by Vconf -m prep SDfile
Find this compound or compounds like it in BindingDB:
Activity Spreadsheet -- Enzyme Inhibition Constant Data from BindingDB
Found 4 hits for monomerid = 50254000
TargetAdenosine receptor A2a(Homo sapiens (Human))
Vernalis R&D
Curated by ChEMBL
LigandPNGBDBM50254000(3-(2-Fluorobenzyl)-7-(5-methyl-2-furyl)-3H-[1,2,3]...)
Affinity DataKi:  2.10nM. Assay description: Displacement of radioligand from human recombinant adenosine A2A receptor at 21 degC after 90 mins by cell-based microplate scintillation counting
In DepthDetails ArticlePubMed
TargetAdenosine receptor A2b(Homo sapiens (Human))
Vernalis R&D
Curated by ChEMBL
LigandPNGBDBM50254000(3-(2-Fluorobenzyl)-7-(5-methyl-2-furyl)-3H-[1,2,3]...)
Affinity DataKi:  6nM. Assay description: Displacement of radioligand from human recombinant adenosine A2B receptor at 21 degC after 60 mins by cell-based microplate scintillation counting
In DepthDetails ArticlePubMed
TargetAdenosine receptor A1(Homo sapiens (Human))
Vernalis R&D
Curated by ChEMBL
LigandPNGBDBM50254000(3-(2-Fluorobenzyl)-7-(5-methyl-2-furyl)-3H-[1,2,3]...)
Affinity DataKi:  19nM. Assay description: Displacement of radioligand from human recombinant adenosine A1 receptor at 21 degC after 90 mins by cell-based microplate scintillation counting
In DepthDetails ArticlePubMed
TargetAdenosine receptor A3(Homo sapiens (Human))
Vernalis R&D
Curated by ChEMBL
LigandPNGBDBM50254000(3-(2-Fluorobenzyl)-7-(5-methyl-2-furyl)-3H-[1,2,3]...)
Affinity DataKi:  260nM. Assay description: Displacement of radioligand from human recombinant adenosine A3 receptor at 21 degC after 60 mins by cell-based microplate scintillation counting
In DepthDetails ArticlePubMed