BDBM50254049 (S)-N-methyl-4-(naphthalen-1-yl)-4-(thiophen-2-yl)butan-1-amine hydrochloride::CHEMBL459732
SMILES CNCCC[C@H](c1cccs1)c1cccc2ccccc12
InChI Key InChIKey=JPEHRAJRTLFJDP-SFHVURJKSA-N
Data  2 KI  1 IC50
  Tab Delimited (TSV)   2D SDfile   Computed 3D by Vconf -m prep SDfile
Find this compound or compounds like it in BindingDB:
Activity Spreadsheet -- Enzyme Inhibition Constant Data from BindingDB
Found 3 hits for monomerid = 50254049
TargetTransporter(Rattus norvegicus (rat))
The State University Of New York
Curated by ChEMBL
LigandPNGBDBM50254049((S)-N-methyl-4-(naphthalen-1-yl)-4-(thiophen-2-yl)...)
Affinity DataKi:  7.90nM. Assay description: Displacement of [3H]nisoxetine from Sprague-dawley rat NET by liquid scintillation spectrophotometry
In DepthDetails ArticlePubMed
TargetSodium-dependent serotonin transporter(Rattus norvegicus (rat))
The State University Of New York
Curated by ChEMBL
LigandPNGBDBM50254049((S)-N-methyl-4-(naphthalen-1-yl)-4-(thiophen-2-yl)...)
Affinity DataKi:  39.7nM. Assay description: Displacement of [3H]citalopram from SERT in Sprague-dawley rat frontal cortex by liquid scintillation spectrophotometry
In DepthDetails ArticlePubMed
TargetSodium-dependent dopamine transporter(Rattus norvegicus (rat))
The State University Of New York
Curated by ChEMBL
LigandPNGBDBM50254049((S)-N-methyl-4-(naphthalen-1-yl)-4-(thiophen-2-yl)...)
Affinity DataIC50:  466nM. Assay description: Displacement of [125I]RTI55 from DAT in Sprague-dawley rat striatum by liquid scintillation spectrophotometry
In DepthDetails ArticlePubMed