BDBM50254312 (+/-)-3-[3-[4-(2-Amino-ethyl)-piperidin-1-yl]-2-(2'-chloro-biphenyl-3-sulfonylamino)-3-oxo-propyl]-benzamidine::CHEMBL513818
SMILES NCCC1CCN(CC1)C(=O)C(Cc1cccc(c1)C(N)=N)NS(=O)(=O)c1cccc(c1)-c1ccccc1Cl
InChI Key InChIKey=GYNIHHFDCVUJCX-UHFFFAOYSA-N
Data  5 KI
  Tab Delimited (TSV)   2D SDfile   Computed 3D by Vconf -m prep SDfile
Find this compound or compounds like it in BindingDB:
Activity Spreadsheet -- Enzyme Inhibition Constant Data from BindingDB
Found 5 hits for monomerid = 50254312
TargetProthrombin(Homo sapiens (Human))
Curacyte Discovery
Curated by ChEMBL
LigandPNGBDBM50254312((+/-)-3-[3-[4-(2-Amino-ethyl)-piperidin-1-yl]-2-(2...)
Affinity DataKi:  11nM. Assay description: Inhibition of thrombin (unknown origin)
In DepthDetails ArticlePubMed
TargetSuppressor of tumorigenicity 14 protein(Homo sapiens (Human))
Curacyte Discovery
Curated by ChEMBL
LigandPNGBDBM50254312((+/-)-3-[3-[4-(2-Amino-ethyl)-piperidin-1-yl]-2-(2...)
Affinity DataKi:  29nM. Assay description: Inhibition of matriptase (unknown origin)
In DepthDetails ArticlePubMed
TargetPlasminogen(Homo sapiens (Human))
Curacyte Discovery
Curated by ChEMBL
LigandPNGBDBM50254312((+/-)-3-[3-[4-(2-Amino-ethyl)-piperidin-1-yl]-2-(2...)
Affinity DataKi:  85nM. Assay description: Inhibition of plasmin (unknown origin)
In DepthDetails ArticlePubMed
TargetCoagulation factor X(Homo sapiens (Human))
Curacyte Discovery
Curated by ChEMBL
LigandPNGBDBM50254312((+/-)-3-[3-[4-(2-Amino-ethyl)-piperidin-1-yl]-2-(2...)
Affinity DataKi:  700nM. Assay description: Inhibition of factor 10a (unknown origin)
In DepthDetails ArticlePubMed
TargetUrokinase-type plasminogen activator(Homo sapiens (Human))
Curacyte Discovery
Curated by ChEMBL
LigandPNGBDBM50254312((+/-)-3-[3-[4-(2-Amino-ethyl)-piperidin-1-yl]-2-(2...)
Affinity DataKi:  1.20E+4nM. Assay description: Inhibition of uPA (unknown origin)
In DepthDetails ArticlePubMed