BDBM50254398 7-(2-Furyl)-3-(5-indolylmethyl)-3H-[1,2,3]triazolo[4,5-d]pyrimidine-5-amine::CHEMBL468256
SMILES Nc1nc(-c2ccco2)c2nnn(Cc3ccc4[nH]ccc4c3)c2n1
InChI Key InChIKey=XLVPNYUXEMZIGX-UHFFFAOYSA-N
Data  4 KI
  Tab Delimited (TSV)   2D SDfile   Computed 3D by Vconf -m prep SDfile
Find this compound or compounds like it in BindingDB:
Activity Spreadsheet -- Enzyme Inhibition Constant Data from BindingDB
Found 4 hits for monomerid = 50254398
TargetAdenosine receptor A2a(Homo sapiens (Human))
Vernalis R&D
Curated by ChEMBL
LigandPNGBDBM50254398(7-(2-Furyl)-3-(5-indolylmethyl)-3H-[1,2,3]triazolo...)
Affinity DataKi:  1.10nM. Assay description: Displacement of radioligand from human recombinant adenosine A2A receptor at 21 degC after 90 mins by cell-based microplate scintillation counting
In DepthDetails ArticlePubMed
TargetAdenosine receptor A1(Homo sapiens (Human))
Vernalis R&D
Curated by ChEMBL
LigandPNGBDBM50254398(7-(2-Furyl)-3-(5-indolylmethyl)-3H-[1,2,3]triazolo...)
Affinity DataKi:  27nM. Assay description: Displacement of radioligand from human recombinant adenosine A1 receptor at 21 degC after 90 mins by cell-based microplate scintillation counting
In DepthDetails ArticlePubMed
TargetAdenosine receptor A2b(Homo sapiens (Human))
Vernalis R&D
Curated by ChEMBL
LigandPNGBDBM50254398(7-(2-Furyl)-3-(5-indolylmethyl)-3H-[1,2,3]triazolo...)
Affinity DataKi:  59nM. Assay description: Displacement of radioligand from human recombinant adenosine A2B receptor at 21 degC after 60 mins by cell-based microplate scintillation counting
In DepthDetails ArticlePubMed
TargetAdenosine receptor A3(Homo sapiens (Human))
Vernalis R&D
Curated by ChEMBL
LigandPNGBDBM50254398(7-(2-Furyl)-3-(5-indolylmethyl)-3H-[1,2,3]triazolo...)
Affinity DataKi:  606nM. Assay description: Displacement of radioligand from human recombinant adenosine A3 receptor at 21 degC after 60 mins by cell-based microplate scintillation counting
In DepthDetails ArticlePubMed