BDBM50254415 3-(2,4-dichlorophenyl)-N-(3-hydroxypropyl)-1H-pyrazole-5-carboxamide::CHEMBL450981::cid_24178178
SMILES OCCCNC(=O)c1cc(n[nH]1)-c1ccc(Cl)cc1Cl
InChI Key InChIKey=YXCNHRHORIEJOU-UHFFFAOYSA-N
Data  2 IC50
  Tab Delimited (TSV)   2D SDfile   Computed 3D by Vconf -m prep SDfile
Find this compound or compounds like it in BindingDB:
Activity Spreadsheet -- Enzyme Inhibition Constant Data from BindingDB
Found 2 hits for monomerid = 50254415
TargetAlkaline phosphatase, tissue-nonspecific isozyme(Homo sapiens (Human))
Institute For Medical Research
Curated by ChEMBL
LigandPNGBDBM50254415(3-(2,4-dichlorophenyl)-N-(3-hydroxypropyl)-1H-pyra...)
Affinity DataIC50:  31nM. Assay description: Inhibition of TNSALP (unknown origin)
In DepthDetails ArticlePubMed
TargetAlkaline phosphatase, tissue-nonspecific isozyme(Homo sapiens (Human))
Institute For Medical Research
Curated by ChEMBL
LigandPNGBDBM50254415(3-(2,4-dichlorophenyl)-N-(3-hydroxypropyl)-1H-pyra...)
Affinity DataIC50:  31.3nM. Assay description: Sanford-Burnham Center for Chemical Genomics (SBCCG) Sanford-Burnham Medical Research Institute (SBMRI, San Diego, CA) NIH Molecular Libraries Screen...
In DepthDetails PCBioAssay