BDBM50255003 CHEMBL519613::N-((R)-3-((S)-2-(1H-benzo[d]imidazol-2-yl)pyrrolidin-1-yl)-2-(cyclopropylmethyl)-3-oxopropyl)-N-hydroxyformamide
SMILES ON(C[C@@H](CC1CC1)C(=O)N1CCC[C@H]1c1nc2ccccc2[nH]1)C=O
InChI Key InChIKey=LZHNVLKCFOLVSY-PBHICJAKSA-N
Data  1 IC50
  Tab Delimited (TSV)   2D SDfile   Computed 3D by Vconf -m prep SDfile
Find this compound or compounds like it in BindingDB:
Activity Spreadsheet -- Enzyme Inhibition Constant Data from BindingDB
Found 1 hit for monomerid = 50255003
TargetPeptide deformylase(Mycobacterium tuberculosis)
Novartis Institute For Tropical Diseases
Curated by ChEMBL
LigandPNGBDBM50255003(CHEMBL519613 | N-((R)-3-((S)-2-(1H-benzo[d]imidazo...)
Affinity DataIC50:  8nM. Assay description: Inhibition of Mycobacterium tuberculosis peptide deformylase expressed in Escherichia coli M15(pREp4) by microplate assay
In DepthDetails ArticlePubMed