BDBM50255351 3-Chloro-N-[1-(2S-ethyl-4-oxo-tetrahydro-furan-3S-ylcarbamoyl)-2S-(1-methyl-cyclopentyl)-ethyl]-4-methanesulfonylamino-benzamide::CHEMBL519135
SMILES CC[C@@H]1OCC(=O)[C@H]1NC(=O)[C@H](CC1(C)CCCC1)NC(=O)c1ccc(NS(C)(=O)=O)c(Cl)c1
InChI Key InChIKey=KQXQLJBYHQUENE-YSIASYRMSA-N
Data  3 KI
  Tab Delimited (TSV)   2D SDfile   Computed 3D by Vconf -m prep SDfile
Find this compound or compounds like it in BindingDB:
Activity Spreadsheet -- Enzyme Inhibition Constant Data from BindingDB
Found 3 hits for monomerid = 50255351
TargetCathepsin S(Homo sapiens (Human))
Medivir
Curated by ChEMBL
LigandPNGBDBM50255351(3-Chloro-N-[1-(2S-ethyl-4-oxo-tetrahydro-furan-3S-...)
Affinity DataKi:  5.60nM. Assay description: Inhibition of human recombinant cathepsin S expressed in baculovirus by fluorescence assay
In DepthDetails ArticlePubMed
TargetCathepsin K(Homo sapiens (Human))
Medivir
Curated by ChEMBL
LigandPNGBDBM50255351(3-Chloro-N-[1-(2S-ethyl-4-oxo-tetrahydro-furan-3S-...)
Affinity DataKi:  840nM. Assay description: Inhibition of human recombinant cathepsin K expressed in baculovirus by fluorescence assay
In DepthDetails ArticlePubMed
TargetProcathepsin L(Homo sapiens (Human))
Medivir
Curated by ChEMBL
LigandPNGBDBM50255351(3-Chloro-N-[1-(2S-ethyl-4-oxo-tetrahydro-furan-3S-...)
Affinity DataKi:  970nM. Assay description: Inhibition of human cathepsin L by fluorescence assay
In DepthDetails ArticlePubMed