BDBM50255430 CHEMBL473035::N-(4-(5-(ethyl(2-hydroxyethyl)amino)pentyl)cyclohexyl)-N-methyl-4-(trifluoromethyl)benzenesulfonamide fumarate
SMILES CCN(CCO)CCCCC[C@H]1CC[C@@H](CC1)N(C)S(=O)(=O)c1ccc(cc1)C(F)(F)F
InChI Key InChIKey=OCRKFUIPATUNNJ-XUTJKUGGSA-N
Data  3 IC50
  Tab Delimited (TSV)   2D SDfile   Computed 3D by Vconf -m prep SDfile
Find this compound or compounds like it in BindingDB:
Activity Spreadsheet -- Enzyme Inhibition Constant Data from BindingDB
Found 3 hits for monomerid = 50255430
TargetLanosterol synthase ERG7(Saccharomyces cerevisiae)
Università
Curated by ChEMBL
LigandPNGBDBM50255430(CHEMBL473035 | N-(4-(5-(ethyl(2-hydroxyethyl)amino...)
Affinity DataIC50:  270nM. Assay description: Inhibition of yeast OSC expressed in Saccharomyces cerevisiae SMY8
In DepthDetails ArticlePubMed
TargetCycloartenol synthase(Arabidopsis thaliana)
Università
Curated by ChEMBL
LigandPNGBDBM50255430(CHEMBL473035 | N-(4-(5-(ethyl(2-hydroxyethyl)amino...)
Affinity DataIC50:  3.00E+3nM. Assay description: Inhibition of Arabidopsis thaliana cycloartenol synthase expressed in Saccharomyces cerevisiae SMY8
In DepthDetails ArticlePubMed
TargetLanosterol synthase(Homo sapiens (Human))
Università
Curated by ChEMBL
LigandPNGBDBM50255430(CHEMBL473035 | N-(4-(5-(ethyl(2-hydroxyethyl)amino...)
Affinity DataIC50:  450nM. Assay description: Inhibition of human OSC expressed in Saccharomyces cerevisiae SMY8
In DepthDetails ArticlePubMed