BDBM50255433 4-(4-(3-(4-bromophenyl)benzo[d]isothiazol-6-yloxy)butyl)morpholine hydrobromide::CHEMBL480049
SMILES Brc1ccc(cc1)-c1nsc2cc(OCCCCN3CCOCC3)ccc12
InChI Key InChIKey=HPERNTFNLJVDCD-UHFFFAOYSA-N
Data  3 IC50
  Tab Delimited (TSV)   2D SDfile   Computed 3D by Vconf -m prep SDfile
Find this compound or compounds like it in BindingDB:
Activity Spreadsheet -- Enzyme Inhibition Constant Data from BindingDB
Found 3 hits for monomerid = 50255433
TargetLanosterol synthase(Homo sapiens (Human))
Università
Curated by ChEMBL
LigandPNGBDBM50255433(4-(4-(3-(4-bromophenyl)benzo[d]isothiazol-6-yloxy)...)
Affinity DataIC50:  120nM. Assay description: Inhibition of human OSC expressed in Saccharomyces cerevisiae SMY8
In DepthDetails ArticlePubMed
TargetLanosterol synthase ERG7(Saccharomyces cerevisiae)
Università
Curated by ChEMBL
LigandPNGBDBM50255433(4-(4-(3-(4-bromophenyl)benzo[d]isothiazol-6-yloxy)...)
Affinity DataIC50:  600nM. Assay description: Inhibition of yeast OSC expressed in Saccharomyces cerevisiae SMY8
In DepthDetails ArticlePubMed
TargetCycloartenol synthase(Arabidopsis thaliana)
Università
Curated by ChEMBL
LigandPNGBDBM50255433(4-(4-(3-(4-bromophenyl)benzo[d]isothiazol-6-yloxy)...)
Affinity DataIC50:  480nM. Assay description: Inhibition of Arabidopsis thaliana cycloartenol synthase expressed in Saccharomyces cerevisiae SMY8
In DepthDetails ArticlePubMed