BDBM50255585 CHEMBL4094381
SMILES C1CN(C(CO1)c1ccccc1)c1ccnc2[nH]ncc12
InChI Key InChIKey=SHOIDMMLBCSHEP-UHFFFAOYSA-N
Data  1 IC50
  Tab Delimited (TSV)   2D SDfile   Computed 3D by Vconf -m prep SDfile
Find this compound or compounds like it in BindingDB:
Activity Spreadsheet -- Enzyme Inhibition Constant Data from BindingDB
Found 1 hit for monomerid = 50255585
TargetOxidized purine nucleoside triphosphate hydrolase(Homo sapiens (Human))
Sprint Bioscience
Curated by ChEMBL
LigandPNGBDBM50255585(CHEMBL4094381)
Affinity DataIC50:  2nM. Assay description: Inhibition of human full length MTH1 using 8-Oxo-2-dGTP as substrate preincubated for 15 mins followed substrate addition measured after 1 hr by PPil...
In DepthDetails ArticlePubMed