BDBM50255617 CHEMBL4095468
SMILES Clc1cccc(c1)-c1ccnc2[nH]c(cc12)C(=O)NC1CC1
InChI Key InChIKey=LTIHBIHIFAPSMB-UHFFFAOYSA-N
Data  1 IC50
  Tab Delimited (TSV)   2D SDfile   Computed 3D by Vconf -m prep SDfile
Find this compound or compounds like it in BindingDB:
Activity Spreadsheet -- Enzyme Inhibition Constant Data from BindingDB
Found 1 hit for monomerid = 50255617
TargetOxidized purine nucleoside triphosphate hydrolase(Homo sapiens (Human))
Sprint Bioscience
Curated by ChEMBL
LigandPNGBDBM50255617(CHEMBL4095468)
Affinity DataIC50:  10nM. Assay description: Inhibition of human full length MTH1 using 8-Oxo-2-dGTP as substrate preincubated for 15 mins followed substrate addition measured after 1 hr by PPil...
In DepthDetails ArticlePubMed