BDBM50255809 4-(((R)-3-(3,4-difluorobenzyl)-2,3-dihydro-2-oxoquinoxalin-4(1H)-yl)methyl)-N-hydroxybenzamide::CHEMBL481018
SMILES ONC(=O)c1ccc(CN2[C@H](Cc3ccc(F)c(F)c3)C(=O)Nc3ccccc23)cc1
InChI Key InChIKey=QKRZDRHJZWTKRQ-OAQYLSRUSA-N
Data  3 IC50
  Tab Delimited (TSV)   2D SDfile   Computed 3D by Vconf -m prep SDfile
Find this compound or compounds like it in BindingDB:
Activity Spreadsheet -- Enzyme Inhibition Constant Data from BindingDB
Found 3 hits for monomerid = 50255809
TargetHistone deacetylase 2(Homo sapiens (Human))
Methylgene
Curated by ChEMBL
LigandPNGBDBM50255809(4-(((R)-3-(3,4-difluorobenzyl)-2,3-dihydro-2-oxoqu...)
Affinity DataIC50:  460nM. Assay description: Inhibition of human recombinant histone deacetylase 2
In DepthDetails ArticlePubMed
TargetHistone deacetylase 8(Homo sapiens (Human))
Methylgene
Curated by ChEMBL
LigandPNGBDBM50255809(4-(((R)-3-(3,4-difluorobenzyl)-2,3-dihydro-2-oxoqu...)
Affinity DataIC50:  420nM. Assay description: Inhibition of human recombinant histone deacetylase 8
In DepthDetails ArticlePubMed
TargetHistone deacetylase 6(Homo sapiens (Human))
Methylgene
Curated by ChEMBL
LigandPNGBDBM50255809(4-(((R)-3-(3,4-difluorobenzyl)-2,3-dihydro-2-oxoqu...)
Affinity DataIC50:  40nM. Assay description: Inhibition of human recombinant histone deacetylase 6
In DepthDetails ArticlePubMed