BDBM50256388 (R)-benzyl 4-(3-amino-4-(2,4,5-trifluorophenyl)butanoyl)-1,4-diazepane-1-carboxylate hydrochloride::CHEMBL481714
SMILES N[C@@H](CC(=O)N1CCCN(CC1)C(=O)OCc1ccccc1)Cc1cc(F)c(F)cc1F
InChI Key InChIKey=MFJJPABXTLDOCR-GOSISDBHSA-N
Data  1 IC50
  Tab Delimited (TSV)   2D SDfile   Computed 3D by Vconf -m prep SDfile
Find this compound or compounds like it in BindingDB:
Activity Spreadsheet -- Enzyme Inhibition Constant Data from BindingDB
Found 1 hit for monomerid = 50256388
TargetDipeptidyl peptidase 4(Homo sapiens (Human))
Korea Research Institute Of Chemical Technology
Curated by ChEMBL
LigandPNGBDBM50256388((R)-benzyl 4-(3-amino-4-(2,4,5-trifluorophenyl)but...)
Affinity DataIC50:  490nM. Assay description: Inhibition of DPP4 (unknown origin)
In DepthDetails ArticlePubMed