BDBM50256805 1-(2-Chloro-benzoyl)-3-(1,1-dioxo-1H-1lambda*6*-benzo[b]thiophen-6-yl)-urea::CHEMBL473614
SMILES Clc1ccccc1C(=O)NC(=O)Nc1ccc2C=CS(=O)(=O)c2c1
InChI Key InChIKey=GKADZDQTJJUSFA-UHFFFAOYSA-N
Data  1 IC50
  Tab Delimited (TSV)   2D SDfile   Computed 3D by Vconf -m prep SDfile
Find this compound or compounds like it in BindingDB:
Activity Spreadsheet -- Enzyme Inhibition Constant Data from BindingDB
Found 1 hit for monomerid = 50256805
Target1-phosphatidylinositol 4,5-bisphosphate phosphodiesterase gamma-2(Homo sapiens (Human))
The Institute Of Cancer Research
Curated by ChEMBL
LigandPNGBDBM50256805(1-(2-Chloro-benzoyl)-3-(1,1-dioxo-1H-1lambda*6*-be...)
Affinity DataIC50:  9.50E+3nM. Assay description: Inhibition of recombinant phospholipase C gamma2 (unknown origin) expressed in baculovirus infected Sf9 cells using [3H]PIP2 by flashplate biochemica...
In DepthDetails ArticlePubMed