BDBM50256997 (S)-benzyl 1-(4-(3-methoxyphenyl)thiazol-2-ylamino)-1-oxo-6-(sulfamoylamino)hexan-2-ylcarbamate::CHEMBL474051
SMILES COc1cccc(c1)-c1csc(NC(=O)[C@H](CCCCNS(N)(=O)=O)NC(=O)OCc2ccccc2)n1
InChI Key InChIKey=YAOSRECXNLRTGR-FQEVSTJZSA-N
Data  2 IC50
  Tab Delimited (TSV)   2D SDfile   Computed 3D by Vconf -m prep SDfile
Find this compound or compounds like it in BindingDB:
Activity Spreadsheet -- Enzyme Inhibition Constant Data from BindingDB
Found 2 hits for monomerid = 50256997
TargetHistone deacetylase 6(Homo sapiens (Human))
Methylgene
Curated by ChEMBL
LigandPNGBDBM50256997((S)-benzyl 1-(4-(3-methoxyphenyl)thiazol-2-ylamino...)
Affinity DataIC50:  420nM. Assay description: Inhibition of human recombinant His-tagged HDAC6 expressed in baculovirus
In DepthDetails ArticlePubMed
TargetHistone deacetylase 1(Homo sapiens (Human))
Methylgene
Curated by ChEMBL
LigandPNGBDBM50256997((S)-benzyl 1-(4-(3-methoxyphenyl)thiazol-2-ylamino...)
Affinity DataIC50:  460nM. Assay description: Inhibition of human recombinant FLAG-tagged HDAC1 expressed in baculovirus
In DepthDetails ArticlePubMed