BDBM50257080 CHEMBL4096818
SMILES Cc1cc(Oc2cncc(Cl)c2)cc(n1)C(=O)Nc1ccc(F)cn1
InChI Key InChIKey=CEIBXTSWBBWOPN-UHFFFAOYSA-N
Data  6 IC50
  Tab Delimited (TSV)   2D SDfile   Computed 3D by Vconf -m prep SDfile
Find this compound or compounds like it in BindingDB:
Activity Spreadsheet -- Enzyme Inhibition Constant Data from BindingDB
Found 6 hits for monomerid = 50257080
TargetCytochrome P450 2D6(Homo sapiens (Human))
Vanderbilt University Institute Of Imaging Science
Curated by ChEMBL
LigandPNGBDBM50257080(CHEMBL4096818)
Affinity DataIC50: >3.00E+4nM. Assay description: Inhibition of CYP2D6 in human liver microsomes using dextromethorphan as substrate preincubated for 5 mins followed by NADPH addition measured after ...
In DepthDetails ArticlePubMed
TargetCytochrome P450 2C9(Homo sapiens (Human))
Vanderbilt University Institute Of Imaging Science
Curated by ChEMBL
LigandPNGBDBM50257080(CHEMBL4096818)
Affinity DataIC50:  2.15E+4nM. Assay description: Inhibition of CYP2C9 in human liver microsomes using diclofenac as substrate preincubated for 5 mins followed by NADPH addition measured after 8 mins...
In DepthDetails ArticlePubMed
TargetMetabotropic glutamate receptor 5(Rattus norvegicus (Rat))
Vanderbilt University Institute Of Imaging Science
Curated by ChEMBL
LigandPNGBDBM50257080(CHEMBL4096818)
Affinity DataIC50:  7.20nM. Assay description: Negative allosteric modulation of rat mGlu5 receptor expressed in HEK293A cells assessed as inhibition of glutamate induced-calcium mobilization prei...
In DepthDetails ArticlePubMed
TargetMetabotropic glutamate receptor 5(Rattus norvegicus (Rat))
Vanderbilt University Institute Of Imaging Science
Curated by ChEMBL
LigandPNGBDBM50257080(CHEMBL4096818)
Affinity DataIC50:  7.20nM. Assay description: Negative allosteric modulation of rat mGlu5 receptor expressed in HEK293A cells assessed as inhibition of glutamate induced-calcium mobilization prei...
In DepthDetails ArticlePubMed
TargetCytochrome P450 3A4(Homo sapiens (Human))
Vanderbilt University Institute Of Imaging Science
Curated by ChEMBL
LigandPNGBDBM50257080(CHEMBL4096818)
Affinity DataIC50:  3.80E+3nM. Assay description: Inhibition of CYP3A4 in human liver microsomes using midazolam as substrate preincubated for 5 mins followed by NADPH addition measured after 8 mins ...
In DepthDetails ArticlePubMed
TargetCytochrome P450 1A2(Homo sapiens (Human))
Vanderbilt University Institute Of Imaging Science
Curated by ChEMBL
LigandPNGBDBM50257080(CHEMBL4096818)
Affinity DataIC50:  200nM. Assay description: Inhibition of CYP1A2 in human liver microsomes using tacrine as substrate preincubated for 5 mins followed by NADPH addition measured after 8 mins by...
In DepthDetails ArticlePubMed