BDBM50257279 (+/-)-Cis-(2-Phenylcyclopropyl)methylamineHydrochloride::CHEMBL442657
SMILES NC[C@H]1C[C@H]1c1ccccc1
InChI Key InChIKey=ATTLDOZXPZCOGK-ZJUUUORDSA-N
Data  2 EC50
  Tab Delimited (TSV)   2D SDfile   Computed 3D by Vconf -m prep SDfile
Find this compound or compounds like it in BindingDB:
Activity Spreadsheet -- Enzyme Inhibition Constant Data from BindingDB
Found 2 hits for monomerid = 50257279
Target5-hydroxytryptamine receptor 2B(Homo sapiens (Human))
University Of Illinois At Chicago
Curated by ChEMBL
LigandPNGBDBM50257279((+/-)-Cis-(2-Phenylcyclopropyl)methylamineHydrochl...)
Affinity DataEC50: >1.00E+4nM. Assay description: Agonist activity at human 5HT2B receptor expressed in HEK293 cells assessed as calcium flux by FLIPR assay
In DepthDetails ArticlePubMed
Target5-hydroxytryptamine receptor 2C(Homo sapiens (Human))
University Of Illinois At Chicago
Curated by ChEMBL
LigandPNGBDBM50257279((+/-)-Cis-(2-Phenylcyclopropyl)methylamineHydrochl...)
Affinity DataEC50:  3.02E+3nM. Assay description: Agonist activity at human 5HT2C receptor expressed in HEK293 cells assessed as calcium flux by FLIPR assay
In DepthDetails ArticlePubMed