BDBM50257317 (S)-1-((S)-2-amino-5-(isoindolin-2-yl)-5-oxopentanoyl)pyrrolidine-2-carbonitrile::CHEMBL493543
SMILES N[C@@H](CCC(=O)N1Cc2ccccc2C1)C(=O)N1CCC[C@H]1C#N
InChI Key InChIKey=IHHYZDAZOXJYIO-HOTGVXAUSA-N
Data  3 IC50
  Tab Delimited (TSV)   2D SDfile   Computed 3D by Vconf -m prep SDfile
Find this compound or compounds like it in BindingDB:
Activity Spreadsheet -- Enzyme Inhibition Constant Data from BindingDB
Found 3 hits for monomerid = 50257317
TargetDipeptidyl peptidase 4(Homo sapiens (Human))
National Health Research Institutes
Curated by ChEMBL
LigandPNGBDBM50257317((S)-1-((S)-2-amino-5-(isoindolin-2-yl)-5-oxopentan...)
Affinity DataIC50:  2nM. Assay description: Inhibition of DPP4 (unknown origin)
In DepthDetails ArticlePubMed
TargetDipeptidyl peptidase 2(Homo sapiens (Human))
National Health Research Institutes
Curated by ChEMBL
LigandPNGBDBM50257317((S)-1-((S)-2-amino-5-(isoindolin-2-yl)-5-oxopentan...)
Affinity DataIC50:  1.50E+4nM. Assay description: Inhibition of DPP2 (unknown origin)
In DepthDetails ArticlePubMed
TargetDipeptidyl peptidase 8(Homo sapiens (Human))
National Health Research Institutes
Curated by ChEMBL
LigandPNGBDBM50257317((S)-1-((S)-2-amino-5-(isoindolin-2-yl)-5-oxopentan...)
Affinity DataIC50:  1.20E+3nM. Assay description: Inhibition of DPP8 (unknown origin)
In DepthDetails ArticlePubMed