BDBM50257416 7-Hydroxy-2-(4'-hydroxyphenyl)-3-[(4''-hydroxy-1,1'-biphenyl-4-yl)methyl]-4H-1-benzopyran-4-one::CHEMBL492708
SMILES Oc1ccc(cc1)-c1ccc(Cc2c(oc3cc(O)ccc3c2=O)-c2ccc(O)cc2)cc1
InChI Key InChIKey=NYWHWFKJNUWYNP-UHFFFAOYSA-N
Data  3 IC50
  Tab Delimited (TSV)   2D SDfile   Computed 3D by Vconf -m prep SDfile
Find this compound or compounds like it in BindingDB:
Activity Spreadsheet -- Enzyme Inhibition Constant Data from BindingDB
Found 3 hits for monomerid = 50257416
TargetLow molecular weight phosphotyrosine protein phosphatase(Homo sapiens (Human))
University Of Modena And R.E.
Curated by ChEMBL
LigandPNGBDBM50257416(7-Hydroxy-2-(4'-hydroxyphenyl)-3-[(4''-hydroxy-1,1...)
Affinity DataIC50:  8.20E+3nM. Assay description: Inhibition of human cloned LMW-PTP isoform 1 expressed in Escherichia coli TB1
In DepthDetails ArticlePubMed
TargetTyrosine-protein phosphatase non-receptor type 1(Homo sapiens (Human))
University Of Modena And R.E.
Curated by ChEMBL
LigandPNGBDBM50257416(7-Hydroxy-2-(4'-hydroxyphenyl)-3-[(4''-hydroxy-1,1...)
Affinity DataIC50:  1.70E+4nM. Assay description: Inhibition of human cloned PTP1B expressed in Escherichia coli TB1
In DepthDetails ArticlePubMed
TargetLow molecular weight phosphotyrosine protein phosphatase(Homo sapiens (Human))
University Of Modena And R.E.
Curated by ChEMBL
LigandPNGBDBM50257416(7-Hydroxy-2-(4'-hydroxyphenyl)-3-[(4''-hydroxy-1,1...)
Affinity DataIC50:  1.84E+4nM. Assay description: Inhibition of human cloned LMW-PTP isoform 2 expressed in Escherichia coli TB1
In DepthDetails ArticlePubMed