BDBM50257546 CHEMBL4064589
SMILES FC(F)(F)c1c(ccn2c(CC3CC3)nnc12)-c1ccc(NC2CCOCC2)c(Cl)c1
InChI Key InChIKey=XQCCADHVKCTQDD-UHFFFAOYSA-N
Data  1 KI  1 Kd  2 EC50
  Tab Delimited (TSV)   2D SDfile   Computed 3D by Vconf -m prep SDfile
Find this compound or compounds like it in BindingDB:
Activity Spreadsheet -- Enzyme Inhibition Constant Data from BindingDB
Found 4 hits for monomerid = 50257546
TargetMetabotropic glutamate receptor 2(Homo sapiens (Human))
Leiden University
Curated by ChEMBL
LigandPNGBDBM50257546(CHEMBL4064589)
Affinity DataKi:  5nM. Assay description: Displacement of [3H]-JNJ46281222 from human metabotropic glutamate receptor 2 expressed in CHOK1 cell membranes after 60 mins by microbeta counting a...
In DepthDetails ArticlePubMed
TargetMetabotropic glutamate receptor 2(Homo sapiens (Human))
Leiden University
Curated by ChEMBL
LigandPNGBDBM50257546(CHEMBL4064589)
Affinity DataEC50:  19nM. Assay description: Positive allosteric modulation of human metabotropic glutamate receptor 2 expressed in CHOK1 cell membranes assessed as increase in glutamate-induced...
In DepthDetails ArticlePubMed
TargetMetabotropic glutamate receptor 2(Homo sapiens (Human))
Leiden University
Curated by ChEMBL
LigandPNGBDBM50257546(CHEMBL4064589)
Affinity DataKd:  3.80nM. Assay description: Displacement of [3H]-JNJ46281222 from human metabotropic glutamate receptor 2 expressed in CHOK1 cell membranes after 60 mins by microbeta counting a...
In DepthDetails ArticlePubMed
TargetMetabotropic glutamate receptor 2(Homo sapiens (Human))
Leiden University
Curated by ChEMBL
LigandPNGBDBM50257546(CHEMBL4064589)
Affinity DataEC50:  19nM. Assay description: Binding affinity to human metabotropic glutamate receptor 2 expressed in CHOK1 cell membranes by scintillation proximity assay
In DepthDetails ArticlePubMed