BDBM50257552 CHEMBL4092105
SMILES CC(C)C(=O)c1ccc(OCc2ccc(CNC(=O)c3cn(C)cn3)cc2)c(c1O)C(F)(F)F
InChI Key InChIKey=RYINQFMHVVYWNS-UHFFFAOYSA-N
Data  1 KI  1 Kd  1 EC50
  Tab Delimited (TSV)   2D SDfile   Computed 3D by Vconf -m prep SDfile
Find this compound or compounds like it in BindingDB:
Activity Spreadsheet -- Enzyme Inhibition Constant Data from BindingDB
Found 3 hits for monomerid = 50257552
TargetMetabotropic glutamate receptor 2(Homo sapiens (Human))
Leiden University
Curated by ChEMBL
LigandPNGBDBM50257552(CHEMBL4092105)
Affinity DataKi:  79nM. Assay description: Displacement of [3H]-JNJ46281222 from human metabotropic glutamate receptor 2 expressed in CHOK1 cell membranes after 60 mins by liquid scintillation...
In DepthDetails ArticlePubMed
TargetMetabotropic glutamate receptor 2(Homo sapiens (Human))
Leiden University
Curated by ChEMBL
LigandPNGBDBM50257552(CHEMBL4092105)
Affinity DataEC50:  107nM. Assay description: Binding affinity to human metabotropic glutamate receptor 2 expressed in CHOK1 cell membranes by scintillation proximity assay
In DepthDetails ArticlePubMed
TargetMetabotropic glutamate receptor 2(Homo sapiens (Human))
Leiden University
Curated by ChEMBL
LigandPNGBDBM50257552(CHEMBL4092105)
Affinity DataKd:  100nM. Assay description: Binding affinity to human metabotropic glutamate receptor 2 expressed in CHOK1 cell membranes by scintillation proximity assay
In DepthDetails ArticlePubMed