BDBM50257579 3-(3-chloro-5-fluorophenyl)-2-(pyridin-4-yl)-1H-pyrrolo[3,2-b]pyridine-5-carbonitrile::CHEMBL493511
SMILES Fc1cc(Cl)cc(c1)-c1c([nH]c2ccc(nc12)C#N)-c1ccncc1
InChI Key InChIKey=JQNWYOYBMABACN-UHFFFAOYSA-N
Data  2 IC50
  Tab Delimited (TSV)   2D SDfile   Computed 3D by Vconf -m prep SDfile
Find this compound or compounds like it in BindingDB:
Activity Spreadsheet -- Enzyme Inhibition Constant Data from BindingDB
Found 2 hits for monomerid = 50257579
TargetHepatocyte growth factor receptor(Homo sapiens (Human))
Sichuan University
Curated by ChEMBL
LigandPNGBDBM50257579(3-(3-chloro-5-fluorophenyl)-2-(pyridin-4-yl)-1H-py...)
Affinity DataIC50:  340nM. Assay description: Inhibition of human c-MET
In DepthDetails ArticlePubMed
TargetHepatocyte growth factor receptor(Homo sapiens (Human))
Sichuan University
Curated by ChEMBL
LigandPNGBDBM50257579(3-(3-chloro-5-fluorophenyl)-2-(pyridin-4-yl)-1H-py...)
Affinity DataIC50:  340nM. Assay description: Inhibition of GST-tagged human c-Met expressed in SF9 cells
In DepthDetails ArticlePubMed