BDBM50257725 2,3-dimethoxy-2'-hydroxychalcone::CHEMBL492959
SMILES COc1cccc(\C=C\C(=O)c2ccccc2O)c1OC
InChI Key InChIKey=HKKXNGSRSNONCJ-ZHACJKMWSA-N
Data  1 IC50
  Tab Delimited (TSV)   2D SDfile   Computed 3D by Vconf -m prep SDfile
Find this compound or compounds like it in BindingDB:
Activity Spreadsheet -- Enzyme Inhibition Constant Data from BindingDB
Found 1 hit for monomerid = 50257725
TargetProstaglandin G/H synthase 2(Mus musculus (Mouse))
University Of Medicine And Pharmacy At Ho Chi Minh City
Curated by ChEMBL
LigandPNGBDBM50257725(2,3-dimethoxy-2'-hydroxychalcone | CHEMBL492959)
Affinity DataIC50:  3.80E+3nM. Assay description: Inhibition of COX2-mediated PGE2 production in LPS-stimulated mouse RAW264.7 cells by enzyme immunoassay
In DepthDetails ArticlePubMed