BDBM50258145 CHEMBL4076011
SMILES Cc1ccc2nc(c(NCc3ccccc3)n2c1)-c1ccc(Cl)cn1
InChI Key InChIKey=MWUDXZMTFVOLHM-UHFFFAOYSA-N
Data  1 EC50
  Tab Delimited (TSV)   2D SDfile   Computed 3D by Vconf -m prep SDfile
Find this compound or compounds like it in BindingDB:
Activity Spreadsheet -- Enzyme Inhibition Constant Data from BindingDB
Found 1 hit for monomerid = 50258145
TargetBile acid receptor(Homo sapiens (Human))
Goethe-University Frankfurt
Curated by ChEMBL
LigandPNGBDBM50258145(CHEMBL4076011)
Affinity DataEC50:  7.40nM. Assay description: Transactivation of human FXR expressed in human HeLa cells co-expressing BSEP after 24 hrs by dual-glo luciferase reporter gene assay
In DepthDetails ArticlePubMed