BDBM50258239 CHEMBL4091891
SMILES [H][C@@]12CC[C@H](C(=O)Cn3cc(cn3)[N+]([O-])=O)[C@@]1(C)CC[C@@]1([H])[C@@]2([H])CC[C@]2([H])C[C@](C)(O)CC[C@]12[H]
InChI Key InChIKey=OINGRVYZOUPCBK-UZNJFETESA-N
Data  1 EC50
  Tab Delimited (TSV)   2D SDfile   Computed 3D by Vconf -m prep SDfile
Find this compound or compounds like it in BindingDB:
Activity Spreadsheet -- Enzyme Inhibition Constant Data from BindingDB
Found 1 hit for monomerid = 50258239
TargetGamma-aminobutyric acid receptor subunit alpha-1/beta-2/gamma-2(Homo sapiens (Human))
Sage Therapeutics
Curated by ChEMBL
LigandPNGBDBM50258239(CHEMBL4091891)
Affinity DataEC50:  1.16E+3nM. Assay description: Positive allosteric modulation of GABAA receptor alpha1beta2gamma2 (unknown origin) expressed in mouse LTK cells assessed as potentiation of GABA-med...
In DepthDetails ArticlePubMed