BDBM50258286 CHEMBL522497::N-(piperidin-3-yl)-3-(3-(trifluoromethyl)phenyl)-[1,2,4]triazolo[4,3-b]pyridazin-6-amine
SMILES FC(F)(F)c1cccc(c1)-c1nnc2ccc(NC3CCCNC3)nn12
InChI Key InChIKey=RZPHTCAOYGPVSZ-UHFFFAOYSA-N
Data  1 KI
  Tab Delimited (TSV)   2D SDfile   Computed 3D by Vconf -m prep SDfile
Find this compound or compounds like it in BindingDB:
Activity Spreadsheet -- Enzyme Inhibition Constant Data from BindingDB
Found 1 hit for monomerid = 50258286
TargetSerine/threonine-protein kinase pim-1(Homo sapiens (Human))
Vertex Pharmaceuticals
Curated by ChEMBL
LigandPNGBDBM50258286(CHEMBL522497 | N-(piperidin-3-yl)-3-(3-(trifluorom...)
Affinity DataKi:  94nM. Assay description: Inhibition of Pim1 (unknown origin) assessed as [32P] incorporation preincubated for 15 mins before ATP substrate addition by coupled spectrophotomet...
In DepthDetails ArticlePubMed