BDBM50258379 (S)-5-[1-(2-Methoxymethylpyrrolidinyl)sulfonyl]-1-[4-(oxiran-2-yl)benzyl]isatin::CHEMBL523666
SMILES COC[C@@H]1CCCN1S(=O)(=O)c1ccc2N(Cc3ccc(cc3)C3CO3)C(=O)C(=O)c2c1
InChI Key InChIKey=AEVFCJHPCHDXDJ-PBVYKCSPSA-N
Data  4 IC50
  Tab Delimited (TSV)   2D SDfile   Computed 3D by Vconf -m prep SDfile
Find this compound or compounds like it in BindingDB:
Activity Spreadsheet -- Enzyme Inhibition Constant Data from BindingDB
Found 4 hits for monomerid = 50258379
TargetCaspase-1(Homo sapiens (Human))
Westfalische Wilhelms-Universitat
Curated by ChEMBL
LigandPNGBDBM50258379((S)-5-[1-(2-Methoxymethylpyrrolidinyl)sulfonyl]-1-...)
Affinity DataIC50: >5.00E+5nM. Assay description: Inhibition of human recombinant caspase 1 assessed as accumulation of cleaved fluorogenic 7-amino-4-methylcoumarin after 10 mins
In DepthDetails ArticlePubMed
TargetCaspase-7(Homo sapiens (Human))
Westfalische Wilhelms-Universitat
Curated by ChEMBL
LigandPNGBDBM50258379((S)-5-[1-(2-Methoxymethylpyrrolidinyl)sulfonyl]-1-...)
Affinity DataIC50:  1.90nM. Assay description: Inhibition of human recombinant caspase 7 assessed as accumulation of cleaved fluorogenic 7-amino-4-methylcoumarin after 10 mins
In DepthDetails ArticlePubMed
TargetCaspase-6(Homo sapiens (Human))
Westfalische Wilhelms-Universitat
Curated by ChEMBL
LigandPNGBDBM50258379((S)-5-[1-(2-Methoxymethylpyrrolidinyl)sulfonyl]-1-...)
Affinity DataIC50: >5.00E+5nM. Assay description: Inhibition of human recombinant caspase 6 assessed as accumulation of cleaved fluorogenic 7-amino-4-methylcoumarin after 10 mins
In DepthDetails ArticlePubMed
TargetCaspase-3(Homo sapiens (Human))
Westfalische Wilhelms-Universitat
Curated by ChEMBL
LigandPNGBDBM50258379((S)-5-[1-(2-Methoxymethylpyrrolidinyl)sulfonyl]-1-...)
Affinity DataIC50:  6.60nM. Assay description: Inhibition of human recombinant caspase 3 assessed as accumulation of cleaved fluorogenic 7-amino-4-methylcoumarin after 10 mins
In DepthDetails ArticlePubMed