BDBM50258452 3-(2-chloro-4-((5-isopropyl-3-((2,4,6-trifluorophenoxy)methyl)isoxazol-4-yl)methoxy)styryl)benzoic acid::CHEMBL467054
SMILES CC(C)c1onc(COc2c(F)cc(F)cc2F)c1COc1ccc(\C=C\c2cccc(c2)C(O)=O)c(Cl)c1
InChI Key InChIKey=DLJAMJCELUPGHQ-VOTSOKGWSA-N
Data  2 EC50
  Tab Delimited (TSV)   2D SDfile   Computed 3D by Vconf -m prep SDfile
Find this compound or compounds like it in BindingDB:
Activity Spreadsheet -- Enzyme Inhibition Constant Data from BindingDB
Found 2 hits for monomerid = 50258452
TargetBile acid receptor(Homo sapiens (Human))
Glaxosmithkline
Curated by ChEMBL
LigandPNGBDBM50258452(3-(2-chloro-4-((5-isopropyl-3-((2,4,6-trifluorophe...)
Affinity DataEC50:  300nM. Assay description: Agonist activity at human FXR transfected in african green monkey CV1 cells by luciferase reporter gene transient transfection assay
In DepthDetails ArticlePubMed
TargetBile acid receptor(Homo sapiens (Human))
Glaxosmithkline
Curated by ChEMBL
LigandPNGBDBM50258452(3-(2-chloro-4-((5-isopropyl-3-((2,4,6-trifluorophe...)
Affinity DataEC50:  110nM. Assay description: Agonist activity at human FXR assessed as SRC1 peptide interaction with receptor ligand binding domain by FRET assay
In DepthDetails ArticlePubMed