BDBM50258830 CHEMBL508699
SMILES CO\C(C)=C1\NC(=O)[C@@H](NC(=O)c2csc(n2)-c2cc(O)c(nc2-c2csc(n2)[C@@H]2COC(=O)c3c4CO[C@@H]([C@H](NC(=O)c5csc1n5)c1nc(cs1)C(=O)N2)[C@H](O[C@H]1C[C@](C)(O)[C@@H]([C@H](C)O1)N(C)C)C(=O)OCc1cccc(n3O)c41)-c1nc(cs1)C(=O)NCCNC(=O)CN1CCOCC1)[C@@H](C)O
InChI Key InChIKey=UPJILBVFMLPXHM-LFBRNOOCSA-N
Data  1 IC50
  Tab Delimited (TSV)   2D SDfile   Computed 3D by Vconf -m prep SDfile
Find this compound or compounds like it in BindingDB:
Activity Spreadsheet -- Enzyme Inhibition Constant Data from BindingDB
Found 1 hit for monomerid = 50258830
TargetType-2 angiotensin II receptor(Homo sapiens (Human))
Merck Research Laboratories
Curated by ChEMBL
LigandPNGBDBM50258830(CHEMBL508699)
Affinity DataIC50:  250nM. Assay description: Inhibition of AT2 receptor (unknown origin)
In DepthDetails ArticlePubMed