BDBM50259221 CHEMBL4097472::US10266550, Compound 11d
SMILES Nc1ccc2c(c1)oc1c(N3CCOCC3)c(F)cc3c1n2cc(C(O)=O)c3=O
InChI Key InChIKey=HLLKIMLVONAMSU-UHFFFAOYSA-N
Data  6 IC50
  Tab Delimited (TSV)   2D SDfile   Computed 3D by Vconf -m prep SDfile
Find this compound or compounds like it in BindingDB:
Activity Spreadsheet -- Enzyme Inhibition Constant Data from BindingDB
Found 6 hits for monomerid = 50259221
TargetDNA topoisomerase 1(Escherichia coli (strain K12))
The Florida International University Board Of Trustees
US Patent
LigandPNGBDBM50259221(CHEMBL4097472 | US10266550, Compound 11d)
Affinity DataIC50:  970nM. Assay description: The relaxation activity of E. coli topoisomerase I was assayed in a buffer containing 10 mM Tris-HCl, pH 8.0, 50 mM NaCl, 0.1 mg/mL gelatin, and 0.5 ...
In DepthDetails US Patent
TargetDNA gyrase subunit B(Escherichia coli (strain K12))
The Florida International University Board Of Trustees
US Patent
LigandPNGBDBM50259221(CHEMBL4097472 | US10266550, Compound 11d)
Affinity DataIC50:  7.80E+3nM. Assay description: DNA gyrase supercoiling assays were carried out by mixing the compounds and the enzyme in a similar manner as above (EcTopI relaxation inhibition ass...
In DepthDetails US Patent
TargetDNA topoisomerase 2-alpha(Homo sapiens (Human))
University Of Hawaii At Hilo
Curated by ChEMBL
LigandPNGBDBM50259221(CHEMBL4097472 | US10266550, Compound 11d)
Affinity DataIC50:  1.56E+4nM. Assay description: Inhibition of human topoisomerase-2alpha assessed as reduction in enzyme-mediated decatenation using kinetoplast DNA as substrate after 15 mins by et...
In DepthDetails ArticlePubMed
TargetDNA topoisomerase 2-alpha(Homo sapiens (Human))
University Of Hawaii At Hilo
Curated by ChEMBL
LigandPNGBDBM50259221(CHEMBL4097472 | US10266550, Compound 11d)
Affinity DataIC50:  1.56E+4nM. Assay description: Human Topoisomerase IIα assays were carried out by adding the compounds to 185 ng of kinetoplast DNA (kDNA, from TopoGen) in the buffer supplied...
In DepthDetails US Patent
TargetDNA topoisomerase 1(Mycobacterium tuberculosis (strain ATCC 25618 / H3...)
The Florida International University Board Of Trustees
US Patent
LigandPNGBDBM50259221(CHEMBL4097472 | US10266550, Compound 11d)
Affinity DataIC50:  480nM. Assay description: The relaxation activity of E. coli topoisomerase I was assayed in a buffer containing 10 mM Tris-HCl, pH 8.0, 50 mM NaCl, 0.1 mg/mL gelatin, and 0.5 ...
In DepthDetails US Patent
TargetDNA topoisomerase 1(Homo sapiens (Human))
The Florida International University Board Of Trustees
US Patent
LigandPNGBDBM50259221(CHEMBL4097472 | US10266550, Compound 11d)
Affinity DataIC50:  1.56E+4nM. Assay description: Human topoisomerase I relaxation assays were carried out with 0.5 U of enzyme in reaction buffer supplied by the manufacturer. The enzyme was mixed w...
In DepthDetails US Patent