BDBM50259240 (5-(1-Benzyl-1H-indazol-3-yl)-1,2,4-oxadiazol-3-yl)methanamine::CHEMBL512079
SMILES NCc1noc(n1)-c1nn(Cc2ccccc2)c2ccccc12
InChI Key InChIKey=VUXLKOATKUTQHW-UHFFFAOYSA-N
Data  4 IC50
  Tab Delimited (TSV)   2D SDfile   Computed 3D by Vconf -m prep SDfile
Find this compound or compounds like it in BindingDB:
Activity Spreadsheet -- Enzyme Inhibition Constant Data from BindingDB
Found 4 hits for monomerid = 50259240
TargetCytochrome P450 1A2(Homo sapiens (Human))
University College London
Curated by ChEMBL
LigandPNGBDBM50259240((5-(1-Benzyl-1H-indazol-3-yl)-1,2,4-oxadiazol-3-yl...)
Affinity DataIC50:  9nM. Assay description: Inhibition of human recombinant CYP1A2
In DepthDetails ArticlePubMed
TargetCytochrome P450 3A4(Homo sapiens (Human))
University College London
Curated by ChEMBL
LigandPNGBDBM50259240((5-(1-Benzyl-1H-indazol-3-yl)-1,2,4-oxadiazol-3-yl...)
Affinity DataIC50:  3.10E+3nM. Assay description: Inhibition of human recombinant CYP3A4
In DepthDetails ArticlePubMed
TargetSodium channel protein type 8 subunit alpha(Homo sapiens (Human))
University College London
Curated by ChEMBL
LigandPNGBDBM50259240((5-(1-Benzyl-1H-indazol-3-yl)-1,2,4-oxadiazol-3-yl...)
Affinity DataIC50:  660nM. Assay description: Inhibition of human Nav1.6 expressed in HEK293 cells assessed as change in membrane potential using MP-red voltage sensitve dye
In DepthDetails ArticlePubMed
TargetCytochrome P450 2D6(Homo sapiens (Human))
University College London
Curated by ChEMBL
LigandPNGBDBM50259240((5-(1-Benzyl-1H-indazol-3-yl)-1,2,4-oxadiazol-3-yl...)
Affinity DataIC50:  90nM. Assay description: Inhibition of human recombinant CYP2D6
In DepthDetails ArticlePubMed