BDBM50259261 2-(3-(3,4-dichlorobenzyl)-4-oxo-3,4-dihydroquinazolin-6-ylamino)-2-oxoacetic acid::CHEMBL466890
SMILES OC(=O)C(=O)Nc1ccc2ncn(Cc3ccc(Cl)c(Cl)c3)c(=O)c2c1
InChI Key InChIKey=ZFQYHUXDDOLXRV-UHFFFAOYSA-N
Data  2 IC50
  Tab Delimited (TSV)   2D SDfile   Computed 3D by Vconf -m prep SDfile
Find this compound or compounds like it in BindingDB:
Activity Spreadsheet -- Enzyme Inhibition Constant Data from BindingDB
Found 2 hits for monomerid = 50259261
TargetStearoyl-CoA desaturase(Homo sapiens (Human))
Cv Therapeutics
Curated by ChEMBL
LigandPNGBDBM50259261(2-(3-(3,4-dichlorobenzyl)-4-oxo-3,4-dihydroquinazo...)
Affinity DataIC50: >1.00E+3nM. Assay description: Inhibition of delta(9)-desaturase from human HepG2 cells
In DepthDetails ArticlePubMed
TargetAcyl-CoA desaturase 1(Rattus norvegicus (Rat))
Cv Therapeutics
Curated by ChEMBL
LigandPNGBDBM50259261(2-(3-(3,4-dichlorobenzyl)-4-oxo-3,4-dihydroquinazo...)
Affinity DataIC50:  890nM. Assay description: Inhibition of rat microsomal delta(9)-desaturase
In DepthDetails ArticlePubMed