BDBM50259378 3-(Benzylamino)-4-(pyridin-4-ylamino)cyclobut-3-ene-1,2-dione::CHEMBL466700
SMILES O=c1c(NCc2ccccc2)c(Nc2ccncc2)c1=O
InChI Key InChIKey=YFNYENFUDVWQQF-UHFFFAOYSA-N
Data  1 IC50
  Tab Delimited (TSV)   2D SDfile   Computed 3D by Vconf -m prep SDfile
Find this compound or compounds like it in BindingDB:
Activity Spreadsheet -- Enzyme Inhibition Constant Data from BindingDB
Found 1 hit for monomerid = 50259378
TargetMAP kinase-activated protein kinase 2(Homo sapiens (Human))
Wyeth Research
Curated by ChEMBL
LigandPNGBDBM50259378(3-(Benzylamino)-4-(pyridin-4-ylamino)cyclobut-3-en...)
Affinity DataIC50:  8.80E+4nM. Assay description: Inhibition of human recombinant MK2
In DepthDetails ArticlePubMed