BDBM50259642 CHEMBL4077037
SMILES CC(C)C[C@H](NC(=O)[C@H](Cc1ccccc1)NC(=O)NCc1cccc(C)c1C)B(O)O
InChI Key InChIKey=ZWXBHHXHLYJPNQ-VXKWHMMOSA-N
Data  3 IC50
  Tab Delimited (TSV)   2D SDfile   Computed 3D by Vconf -m prep SDfile
Find this compound or compounds like it in BindingDB:
Activity Spreadsheet -- Enzyme Inhibition Constant Data from BindingDB
Found 3 hits for monomerid = 50259642
TargetProteasome subunit beta type-5(Homo sapiens (Human))
Peking University
Curated by ChEMBL
LigandPNGBDBM50259642(CHEMBL4077037)
Affinity DataIC50:  4nM. Assay description: Inhibition of chymotrypsin-like activity of 20S proteasome in human HL60 cells using Suc-LLVYaminoluciferin as substrate after 2 hrs by fluorescence ...
In DepthDetails ArticlePubMed
TargetProteasome subunit beta type-1(Homo sapiens (Human))
Peking University
Curated by ChEMBL
LigandPNGBDBM50259642(CHEMBL4077037)
Affinity DataIC50:  130nM. Assay description: Inhibition of caspase-like activity of 20S proteasome in human HL60 cells using Z-nLPnLDaminoluciferin as substrate after 2 hrs by fluorescence analy...
In DepthDetails ArticlePubMed
TargetProteasome subunit beta type-2(Homo sapiens (Human))
Peking University
Curated by ChEMBL
LigandPNGBDBM50259642(CHEMBL4077037)
Affinity DataIC50:  340nM. Assay description: Inhibition of trypsin-like activity of 20S proteasome in human HL60 cells using Z-LRRaminoluciferin as substrate after 2 hrs by fluorescence analysis
In DepthDetails ArticlePubMed