BDBM50260101 CHEMBL4068487::US10689390, Compound 38::US11319326, Compound 38
SMILES CCNC(=O)CC1N=C(c2cc(OC)ccc2-c2cn(C)c(=O)cc12)c1c(F)cccc1F
InChI Key InChIKey=QDPGWGQWPZJTJP-UHFFFAOYSA-N
Data  3 IC50
  Tab Delimited (TSV)   2D SDfile   Computed 3D by Vconf -m prep SDfile
Find this compound or compounds like it in BindingDB:
Activity Spreadsheet -- Enzyme Inhibition Constant Data from BindingDB
Found 3 hits for monomerid = 50260101
TargetBromodomain-containing protein 4(Homo sapiens (Human))
University Of Texas Medical Branch
Curated by ChEMBL
LigandPNGBDBM50260101(CHEMBL4068487 | US10689390, Compound 38 | US113193...)
Affinity DataIC50: <0.5nM. Assay description: Inhibition of BRD4 bromodomain 1 (unknown origin) using biotinylated substrate after 1 hr by AlphaLisa assay
Ligand InfoPC cidPC sid
In DepthDetails ArticlePubMed
TargetBromodomain-containing protein 4 [44-168](Homo sapiens (Human))
Jubilant Biosys
US Patent
LigandPNGBDBM50260101(CHEMBL4068487 | US10689390, Compound 38 | US113193...)
Affinity DataIC50: <0.5nM. Assay description: Compounds were diluted by step-down dilution method (final concentration of DMSO was 1%) and added to the wells of a 384 well opti plate at desired c...
Ligand InfoPC cidPC sid
In DepthDetails US Patent
TargetBromodomain-containing protein 4(Homo sapiens (Human))
University Of Texas Medical Branch
Curated by ChEMBL
LigandPNGBDBM50260101(CHEMBL4068487 | US10689390, Compound 38 | US113193...)
Affinity DataIC50: <0.5nM. Assay description: Compounds were diluted by step-down dilution method (final concentration of DMSO was 1%) and added to the wells of a 384 well opti plate at desired c...
Ligand InfoPC cidPC sid
In DepthDetails US Patent