BDBM50260185 CHEMBL4096041
SMILES COc1cc(OC)c(Cl)c(N2Cc3cnc(Nc4ccccc4)nc3N(C3CCN(CC3)C(=O)\C=C\CN(C)C)C2=O)c1Cl
InChI Key InChIKey=YHIGPAIFBVOPKV-DHZHZOJOSA-N
Data  4 IC50
PDB links: 1 PDB ID matches this monomer.
  Tab Delimited (TSV)   2D SDfile   Computed 3D by Vconf -m prep SDfile
Find this compound or compounds like it in BindingDB:
Activity Spreadsheet -- Enzyme Inhibition Constant Data from BindingDB
Found 4 hits for monomerid = 50260185
TargetFibroblast growth factor receptor 4(Homo sapiens (Human))
Guangzhou Institutes Of Biomedicine And Health
Curated by ChEMBL
LigandPNGBDBM50260185(CHEMBL4096041)
Affinity DataIC50:  69nM. Assay description: Inhibition of human recombinant His-tagged FGFR4 cytoplasmic domain (781 to 1338 residues) expressed in baculovirus using Tyr-4 peptide after 1 hr by...
In DepthDetails ArticlePubMed
TargetFibroblast growth factor receptor 2(Homo sapiens (Human))
Guangzhou Institutes Of Biomedicine And Health
Curated by ChEMBL
LigandPNGBDBM50260185(CHEMBL4096041)
Affinity DataIC50:  0.840nM. Assay description: Inhibition of human recombinant cytoplasmic His-tagged FGFR2 (403 to 822 residues) expressed in baculovirus using Tyr-4 peptide after 1 hr by FRET-ba...
TargetFibroblast growth factor receptor 1(Homo sapiens (Human))
Guangzhou Institutes Of Biomedicine And Health
Curated by ChEMBL
LigandPNGBDBM50260185(CHEMBL4096041)
Affinity DataIC50:  1.10nM. Assay description: Inhibition of human recombinant His-tagged FGFR1 cytoplasmic domain (308 to 731 residues) expressed in baculovirus using Tyr-4 peptide after 1 hr by ...
TargetFibroblast growth factor receptor 3(Homo sapiens (Human))
Guangzhou Institutes Of Biomedicine And Health
Curated by ChEMBL
LigandPNGBDBM50260185(CHEMBL4096041)
Affinity DataIC50:  5.40nM. Assay description: Inhibition of human recombinant His-tagged FGFR3 cytoplasmic domain (399 to 806 residues) expressed in baculovirus using Tyr-4 peptide after 1 hr by ...
In DepthDetails ArticlePubMed