BDBM50260309 CHEMBL4077866
SMILES COc1cc2CCN(CC3CCN(Cc4cc(Br)cc(\C=N\O)c4O)CC3)Cc2cc1OC
InChI Key InChIKey=LNTOKRHHALCSCJ-UVHMKAGCSA-N
Data  1 IC50  2 Kd
  Tab Delimited (TSV)   2D SDfile   Computed 3D by Vconf -m prep SDfile
Find this compound or compounds like it in BindingDB:
Activity Spreadsheet -- Enzyme Inhibition Constant Data from BindingDB
Found 3 hits for monomerid = 50260309
TargetAcetylcholinesterase(Homo sapiens (Human))
Fourth Military Medical University
Curated by ChEMBL
LigandPNGBDBM50260309(CHEMBL4077866)
Affinity DataKd:  2.04E+5nM. Assay description: Reactivation of sarin-induced inhibition of human AChE assessed as dissociation constant using acetylthiocholine as substrate preincubated for 30 min...
In DepthDetails ArticlePubMed
TargetAcetylcholinesterase(Homo sapiens (Human))
Fourth Military Medical University
Curated by ChEMBL
LigandPNGBDBM50260309(CHEMBL4077866)
Affinity DataKd:  7.20E+3nM. Assay description: Inhibition of human AChE using acetylthiocholine as substrate preincubated for 30 mins followed by substrate addition measured every 5 mins for 20 mi...
In DepthDetails ArticlePubMed
TargetAcetylcholinesterase(Homo sapiens (Human))
Fourth Military Medical University
Curated by ChEMBL
LigandPNGBDBM50260309(CHEMBL4077866)
Affinity DataIC50:  5.68E+5nM. Assay description: Reactivation of sarin-induced inhibition of human AChE assessed as dissociation constant using acetylthiocholine as substrate preincubated for 30 min...
In DepthDetails ArticlePubMed