BDBM50260822 3-Biphenyl-3-yl-5-[1-(4-chloro-phenyl)-cyclobutyl]-4-methyl-4H-[1,2,4]triazole::CHEMBL525924
SMILES Cn1c(nnc1C1(CCC1)c1ccc(Cl)cc1)-c1cccc(c1)-c1ccccc1
InChI Key InChIKey=FXLJWOWLNCXDCJ-UHFFFAOYSA-N
Data  4 IC50
  Tab Delimited (TSV)   2D SDfile   Computed 3D by Vconf -m prep SDfile
Find this compound or compounds like it in BindingDB:
Activity Spreadsheet -- Enzyme Inhibition Constant Data from BindingDB
Found 4 hits for monomerid = 50260822
Target11-beta-hydroxysteroid dehydrogenase 1(Homo sapiens (Human))
Merck Research Laboratories
Curated by ChEMBL
LigandPNGBDBM50260822(3-Biphenyl-3-yl-5-[1-(4-chloro-phenyl)-cyclobutyl]...)
Affinity DataIC50:  4.30nM. Assay description: Inhibition of human 11beta HSD1 by SPA assay
In DepthDetails ArticlePubMed
Target11-beta-hydroxysteroid dehydrogenase type 2(Mus musculus (mouse))
Merck Research Laboratories
Curated by ChEMBL
LigandPNGBDBM50260822(3-Biphenyl-3-yl-5-[1-(4-chloro-phenyl)-cyclobutyl]...)
Affinity DataIC50: >4.00E+3nM. Assay description: Inhibition of mouse 11beta HSD2
In DepthDetails ArticlePubMed
Target11-beta-hydroxysteroid dehydrogenase type 2(Homo sapiens (Human))
Merck Research Laboratories
Curated by ChEMBL
LigandPNGBDBM50260822(3-Biphenyl-3-yl-5-[1-(4-chloro-phenyl)-cyclobutyl]...)
Affinity DataIC50: >4.00E+3nM. Assay description: Inhibition of human 11beta HSD2
In DepthDetails ArticlePubMed
Target11-beta-hydroxysteroid dehydrogenase 1(Mus musculus (mouse))
Merck Research Laboratories
Curated by ChEMBL
LigandPNGBDBM50260822(3-Biphenyl-3-yl-5-[1-(4-chloro-phenyl)-cyclobutyl]...)
Affinity DataIC50:  56nM. Assay description: Inhibition of mouse 11beta HSD1 by SPA assay
In DepthDetails ArticlePubMed