BDBM50260883 CHEMBL494643::N-hydroxy-2,3-bis(perfluorophenylsulfonamido)propanamide
SMILES ONC(=O)C(CNS(=O)(=O)c1c(F)c(F)c(F)c(F)c1F)NS(=O)(=O)c1c(F)c(F)c(F)c(F)c1F
InChI Key InChIKey=FZONFSJIDBMCOM-UHFFFAOYSA-N
Data  2 KI
  Tab Delimited (TSV)   2D SDfile   Computed 3D by Vconf -m prep SDfile
Find this compound or compounds like it in BindingDB:
Activity Spreadsheet -- Enzyme Inhibition Constant Data from BindingDB
Found 2 hits for monomerid = 50260883
TargetMatrilysin(Homo sapiens (Human))
North Dakota State University
Curated by ChEMBL
LigandPNGBDBM50260883(CHEMBL494643 | N-hydroxy-2,3-bis(perfluorophenylsu...)
Affinity DataKi:  8.60E+3nM. Assay description: Inhibition of human recombinant MMP7
In DepthDetails ArticlePubMed
TargetMatrix metalloproteinase-9(Homo sapiens (Human))
North Dakota State University
Curated by ChEMBL
LigandPNGBDBM50260883(CHEMBL494643 | N-hydroxy-2,3-bis(perfluorophenylsu...)
Affinity DataKi:  2.12E+5nM. Assay description: Inhibition of human recombinant MMP9
In DepthDetails ArticlePubMed