BDBM50260884 2,3-bis(2,4-dimethoxyphenylsulfonamido)-N-hydroxypropanamide::CHEMBL521689
SMILES COc1ccc(c(OC)c1)S(=O)(=O)NCC(NS(=O)(=O)c1ccc(OC)cc1OC)C(=O)NO
InChI Key InChIKey=NUJPTPCEVGHZJB-UHFFFAOYSA-N
Data  3 KI
  Tab Delimited (TSV)   2D SDfile   Computed 3D by Vconf -m prep SDfile
Find this compound or compounds like it in BindingDB:
Activity Spreadsheet -- Enzyme Inhibition Constant Data from BindingDB
Found 3 hits for monomerid = 50260884
TargetMatrilysin(Homo sapiens (Human))
North Dakota State University
Curated by ChEMBL
LigandPNGBDBM50260884(2,3-bis(2,4-dimethoxyphenylsulfonamido)-N-hydroxyp...)
Affinity DataKi:  289nM. Assay description: Inhibition of human recombinant MMP7
In DepthDetails ArticlePubMed
TargetMatrix metalloproteinase-9(Homo sapiens (Human))
North Dakota State University
Curated by ChEMBL
LigandPNGBDBM50260884(2,3-bis(2,4-dimethoxyphenylsulfonamido)-N-hydroxyp...)
Affinity DataKi:  1.24E+5nM. Assay description: Inhibition of human recombinant MMP9
In DepthDetails ArticlePubMed
TargetStromelysin-2(Homo sapiens (Human))
North Dakota State University
Curated by ChEMBL
LigandPNGBDBM50260884(2,3-bis(2,4-dimethoxyphenylsulfonamido)-N-hydroxyp...)
Affinity DataKi:  3.72E+5nM. Assay description: Inhibition of human recombinant MMP10
In DepthDetails ArticlePubMed