BDBM50261173 4-methylcyclohexylamine::CHEMBL510738::cis-4-methylcyclohexanamine
SMILES CC1CCC(N)CC1
InChI Key InChIKey=KSMVBYPXNKCPAJ-UHFFFAOYSA-N
Data  1 IC50
PDB links: 1 PDB ID matches this monomer.
  Tab Delimited (TSV)   2D SDfile   Computed 3D by Vconf -m prep SDfile
Find this compound or compounds like it in BindingDB:
Activity Spreadsheet -- Enzyme Inhibition Constant Data from BindingDB
Found 1 hit for monomerid = 50261173
TargetSpermidine synthase(Plasmodium falciparum)
Inovacia
Curated by ChEMBL
LigandPNGBDBM50261173(4-methylcyclohexylamine | CHEMBL510738 | cis-4-met...)
Affinity DataIC50:  1.40E+3nM. Assay description: Inhibition of Plasmodium falciparum spermidine synthase