BDBM50261424 (R)-N-Isobutyl-3-{{(2S,3S)-3-{(2S)-2-[(2S)-2-pentanoylamino-2-phenyl]acetylamino-3,3-dimethyl}butanoylamino-2-hydroxy-4-phenyl}}butanoyl-5,5-dimethyl-1,3-thiazolidine-4-carboxamide::CHEMBL501965::KNI-10616
SMILES CCCCC(=O)N[C@H](C(=O)N[C@H](C(=O)N[C@@H](Cc1ccccc1)[C@H](O)C(=O)N1CSC(C)(C)[C@H]1C(=O)NCC(C)C)C(C)(C)C)c1ccccc1
InChI Key InChIKey=UFUCCZQWSVOCMC-VYIXFUBHSA-N
Data  1 IC50
  Tab Delimited (TSV)   2D SDfile   Computed 3D by Vconf -m prep SDfile
Find this compound or compounds like it in BindingDB:
Activity Spreadsheet -- Enzyme Inhibition Constant Data from BindingDB
Found 1 hit for monomerid = 50261424
TargetProtease(Human T-lymphotropic virus 1)
Kyoto Pharmaceutical University
Curated by ChEMBL
LigandPNGBDBM50261424((R)-N-Isobutyl-3-{{(2S,3S)-3-{(2S)-2-[(2S)-2-penta...)
Affinity DataIC50:  92nM. Assay description: Inhibition of HTLV1 protease1
In DepthDetails ArticlePubMed