BDBM50261430 (R)-N-Isobutyl-3-{{(2S,3S)-3-{(2S)-2-[(2S)-2-(3-phenyl)-propanoylamino-2-phenyl]acetylamino-3,3-dimethyl}butanoylamino-2-hydroxy-4-phenyl}}butanoyl-5,5-dimethyl-1,3-thiazolidine-4-carboxamide::CHEMBL499472::KNI-10652
SMILES CC(C)CNC(=O)[C@H]1N(CSC1(C)C)C(=O)[C@@H](O)[C@H](Cc1ccccc1)NC(=O)[C@@H](NC(=O)[C@@H](NC(=O)CCc1ccccc1)c1ccccc1)C(C)(C)C
InChI Key InChIKey=VUHLOESWQWNVHT-CTFQGTJTSA-N
Data  1 IC50
  Tab Delimited (TSV)   2D SDfile   Computed 3D by Vconf -m prep SDfile
Find this compound or compounds like it in BindingDB:
Activity Spreadsheet -- Enzyme Inhibition Constant Data from BindingDB
Found 1 hit for monomerid = 50261430
TargetProtease(Human T-lymphotropic virus 1)
Kyoto Pharmaceutical University
Curated by ChEMBL
LigandPNGBDBM50261430((R)-N-Isobutyl-3-{{(2S,3S)-3-{(2S)-2-[(2S)-2-(3-ph...)
Affinity DataIC50:  105nM. Assay description: Inhibition of HTLV1 protease1
In DepthDetails ArticlePubMed