BDBM50261574 5-{2-Ethoxy-5-[(4-(1-(2-methoxyphenyl))piperazinylsulphonyl]phenyl)-1-methyl-3-N-propyl-1,6-dihydro-7H-pyrazolo[4,3-d]pyrimidin-7-one::CHEMBL468760
SMILES CCCc1nn(C)c2c1nc([nH]c2=O)-c1cc(ccc1OCC)S(=O)(=O)N1CCN(CC1)c1ccccc1OC
InChI Key InChIKey=FVIYAPYVMNFXKW-UHFFFAOYSA-N
Data  1 IC50
  Tab Delimited (TSV)   2D SDfile   Computed 3D by Vconf -m prep SDfile
Find this compound or compounds like it in BindingDB:
Activity Spreadsheet -- Enzyme Inhibition Constant Data from BindingDB
Found 1 hit for monomerid = 50261574
TargetcGMP-specific 3',5'-cyclic phosphodiesterase(Homo sapiens (Human))
State University Of Campinas
Curated by ChEMBL
LigandPNGBDBM50261574(5-{2-Ethoxy-5-[(4-(1-(2-methoxyphenyl))piperazinyl...)
Affinity DataIC50:  150nM. Assay description: Inhibition of PDE5 in human platelets after 5 mins by LC-MS/MS analysis
In DepthDetails ArticlePubMed