BDBM50261578 CHEMBL4085932
SMILES [H][C@@]12CC[C@H](OC(=O)CNC(=O)c3ccc(cc3)S(N)(=O)=O)[C@@]1(C)CC[C@]1([H])c3ccc(O)cc3CC[C@@]21[H]
InChI Key InChIKey=QUQXUUADJDQNDF-TXDQRGGKSA-N
Data  1 IC50
  Tab Delimited (TSV)   2D SDfile   Computed 3D by Vconf -m prep SDfile
Find this compound or compounds like it in BindingDB:
Activity Spreadsheet -- Enzyme Inhibition Constant Data from BindingDB
Found 1 hit for monomerid = 50261578
TargetCarbonic anhydrase 2(Homo sapiens (Human))
Evestra
Curated by ChEMBL
LigandPNGBDBM50261578(CHEMBL4085932)
Affinity DataIC50:  65nM. Assay description: Inhibition of human CA2 catalytic activity pre-incubated for 15 mins followed by 4-NPA substrate addition and measured every 12 to 15 secs for 5 mins...
In DepthDetails ArticlePubMed