BDBM50261602 5-{2-Ethoxy-5-[(4-(2-fluorophenyl)piperazinylsulphonyl]phenyl)-1-methyl-3-N-propyl-1,6-dihydro-7H-pyrazolo[4,3-d]pyrimidin-7-one::CHEMBL467592
SMILES CCCc1nn(C)c2c1nc([nH]c2=O)-c1cc(ccc1OCC)S(=O)(=O)N1CCN(CC1)c1ccccc1F
InChI Key InChIKey=MOHNNTDSKJHBJS-UHFFFAOYSA-N
Data  1 IC50
  Tab Delimited (TSV)   2D SDfile   Computed 3D by Vconf -m prep SDfile
Find this compound or compounds like it in BindingDB:
Activity Spreadsheet -- Enzyme Inhibition Constant Data from BindingDB
Found 1 hit for monomerid = 50261602
TargetcGMP-specific 3',5'-cyclic phosphodiesterase(Homo sapiens (Human))
State University Of Campinas
Curated by ChEMBL
LigandPNGBDBM50261602(5-{2-Ethoxy-5-[(4-(2-fluorophenyl)piperazinylsulph...)
Affinity DataIC50:  60nM. Assay description: Inhibition of PDE5 in human platelets after 5 mins by LC-MS/MS analysis
In DepthDetails ArticlePubMed